{"text_format":"1","workbook":"xlsx","n_sheets":12,"sheets":["start","output","TemplatePDF","PDF","DCP Simulator","DataBackup","markets","Languages","calendar","Holidays","DCP_LimitCalculation","AuxiliaryCalculationTab"],"not_rendered":{"charts":0,"images":1,"macros":1,"external_links":1,"defined_names":188,"comments":3,"pivot_tables":0},"unopened":[],"bounds":{"document_bytes":16777216,"sheet_cells":100000,"rows_first":2000,"rows_last":500,"rows_between":2000,"halvings":0,"cell_chars":16384,"cell_head_chars":4096},"cells_cut":0,"cells_raw":0,"read":"whole","date_system":"1900"}

{"sheet":"start","index":0,"n_rows":48,"n_cols":7,"rows_kept":48,"cut":false,"hidden":true,"merged":[[12,0,15,0],[12,1,15,1],[12,2,14,3],[3,5,3,18],[11,5,11,22],[10,5,10,22],[8,5,8,22],[9,5,9,22]]}
[]
[null,null,null,"DCP"]
[null,null,null,"ABCEX",null,"Introduction:"]
[null,null,null,null,null,"The aim of this tool is to always know the base exposure which is calculate from the set base limits. Your base exposure must always be lower or equal to your collateral.\nAlso this tool shows the baselimit which you will get for each day, including holidays. Therefore, prior to holidays please check with the help of this tool if the current set up/Collateral\nis still sufficient. If you have question regarding any holidays please reach out to clearing@ecc.de. "]
["COLLATERAL","In which currency (EUR or GBP) will the collateral be provided?"]
[]
[null,null,null,"COLLATERAL Currency"]
[null,null,null,"GBP",null,"Mannual:"]
[null,null,"Exchange Rate GBP/EUR",1.0626992561105209,null,"You need to choose the currency of your collateral. Afterwards set the markets, currency, baselimit business day and for non-business days. After setting the date (careful first day must be an ECC businessday) press Start Base Limit Calculation"]
[null,null,"invers zu D9:","0,941",null,"After any changes (new market, different base limit etc.) the button Start Base Limit Calculation must be pressed."]
["CLIENT PREFERENCES",null,null,null,null,"The result can be seen on the \"output\" sheet. Here you can see multiple things. First you see the maximum base exposure during the time period you chose as input in C25 and D25 "]
[{"$f":"COUNTA($A$17:$A$24)","v":2},null,null,null,null,"Then you can also find the base limit given on the respective day in column \"I\" and the base exposure for that day in column \"K\"."]
["MARKET",null,"Define the base Limit amount necessary for each calendar day in the markets on business days and non-business days here:"]
[]
[]
[null,null,"BIZ DAY - ABSOLUTE","NON BIZ DAY - ABSOLUTE"]
["EPEX_AUCTION_EUR","EUR",52000,0]
["EPEX_CONTINUOUS_EUR","EUR",50000,20000]
[]
[]
{"$rows_left_out":29}
{"sheet":"output","index":1,"n_rows":14,"n_cols":12,"rows_kept":14,"cut":false,"hidden":true,"merged":[[0,6,0,9]]}
[null,null,null,null,null,null,"Max Base Exposure over input time",null,null,null,{"$f":"MAX(K4:K10000)","v":348000},{"$f":"Input_Cur","v":"GBP"}]
[]
["bd_0","DCP","Market","Currency","d_i","Flag Payment Day","Flag Reset and ECC Business Day","BaseValues \ndistributed","BaseLimit","BaseExposure\nin Market Currency","BaseExposure\nin Collateral Currency"]
["2025-01-09","ABCEX",null,null,null,null,null,null,null,null,348000]
["2025-01-09","ABCEX","EPEX_AUCTION_EUR","EUR","2025-01-09",1,1,null,null,208000,208000]
["2025-01-09","ABCEX","EPEX_AUCTION_EUR","EUR","2025-01-10",1,1,52000,52000]
["2025-01-09","ABCEX","EPEX_AUCTION_EUR","EUR","2025-01-11",0,0,0,52000]
["2025-01-09","ABCEX","EPEX_AUCTION_EUR","EUR","2025-01-12",0,0,0,52000]
["2025-01-09","ABCEX","EPEX_AUCTION_EUR","EUR","2025-01-13",1,1,52000,52000]
["2025-01-09","ABCEX","EPEX_CONTINUOUS_EUR","EUR","2025-01-09",1,1,null,null,140000,140000]
["2025-01-09","ABCEX","EPEX_CONTINUOUS_EUR","EUR","2025-01-10",1,1,50000,50000]
["2025-01-09","ABCEX","EPEX_CONTINUOUS_EUR","EUR","2025-01-11",0,0,20000,90000]
["2025-01-09","ABCEX","EPEX_CONTINUOUS_EUR","EUR","2025-01-12",0,0,20000,90000]
["2025-01-09","ABCEX","EPEX_CONTINUOUS_EUR","EUR","2025-01-13",1,1,50000,90000]

{"sheet":"TemplatePDF","index":2,"n_rows":137,"n_cols":7,"rows_kept":137,"cut":false,"hidden":true,"merged":[[132,2,132,5],[133,2,133,5],[134,2,134,5],[136,1,140,6],[126,2,126,5],[127,2,127,5],[128,2,128,5],[129,2,129,5],[130,2,130,5],[131,2,131,5],[125,2,125,5],[113,2,113,5],[114,2,114,5],[115,2,115,5],[116,2,116,5],[117,2,117,5],[118,2,118,5],[105,2,105,5],[119,2,119,5],[120,2,120,5],[121,2,121,5],[124,2,124,5],[106,2,106,5],[107,2,107,5],[108,2,108,5],[111,2,111,5],[112,2,112,5],[100,2,100,5],[101,2,101,5],[102,2,102,5],[103,2,103,5],[104,2,104,5],[99,2,99,5],[78,2,78,5],[79,2,79,5],[80,2,80,5],[81,2,81,5],[82,2,82,5],[83,2,83,5],[70,2,70,5],[84,2,84,5],[85,2,85,5],[86,2,86,5],[98,2,98,5],[71,2,71,5],[72,2,72,5],[73,2,73,5],[76,2,76,5],[77,2,77,5],[65,2,65,5],[66,2,66,5],[67,2,67,5],[68,2,68,5],[69,2,69,5],[64,2,64,5],[52,2,52,5],[53,2,53,5],[54,2,54,5],[55,2,55,5],[56,2,56,5],[57,2,57,5],[40,2,40,5],[58,2,58,5],[59,2,59,5],[60,2,60,5],[63,2,63,5],[41,2,41,5],[42,2,42,5],[43,2,43,5],[50,2,50,5],[51,2,51,5],[35,2,35,5],[36,2,36,5],[37,2,37,5],[38,2,38,5],[39,2,39,5],[34,2,34,5],[22,2,22,5],[23,2,23,5],[24,2,24,5],[25,2,25,5],[26,2,26,5],[27,2,27,5],[14,1,14,2],[28,2,28,5],[29,2,29,5],[30,2,30,5],[33,2,33,5],[15,1,15,2],[16,1,16,2],[17,1,17,2],[20,2,20,5],[21,2,21,5],[18,1,18,6],[9,1,9,2],[10,1,10,2],[11,1,11,2],[12,1,12,2],[13,1,13,2]]}
[null,"DCP Simulation"]
[]
[null,"DCP:","ABCEX",null,"Trading date:","09.01.2025"]
[null,"Calendar:","T2 - Target2"]
[]
[null,"Collateral:",1000000,null,"Open fin. Risk:",0]
[null,"Coll.Currency:","GBP",null,"Resolved fin. Risk:",0]
[null,"Exchange Rate: ",1063]
[]
[null,"Limit Definition",null,"Currency","Business Day-Base\nlimit (optional*)","Non Business Day-Base\nlimit (optional*)","Collateral\nDistribution\nkey in %**"]
[null,"EPEX_AUCTION_EUR",null,"EUR","52000","0","50"]
[null,"EPEX_CONTINUOUS_EUR",null,"EUR","50000","20000","50"]
[]
[]
[]
[]
[]
[]
[null,"To obtain these member preferences, please send us an O09 form\nand transfer the information from this sheet into the form"]
[null,"Market: EPEX_AUCTION_EUR"]
{"$rows_left_out":118}
{"sheet":"PDF","index":3,"n_rows":48,"n_cols":7,"rows_kept":48,"cut":false,"hidden":true,"merged":[[21,2,21,5],[9,1,9,2],[10,1,10,2],[11,1,11,2],[12,1,12,6],[20,2,20,5],[35,2,35,5],[22,2,22,5],[23,2,23,5],[24,2,24,5],[25,2,25,5],[26,2,26,5],[27,2,27,5],[28,2,28,5],[29,2,29,5],[30,2,30,5],[33,2,33,5],[34,2,34,5],[42,2,42,5],[43,2,43,5],[47,1,50,6],[36,2,36,5],[37,2,37,5],[38,2,38,5],[39,2,39,5],[40,2,40,5],[41,2,41,5]]}
[null,"DCP Simulation"]
[]
[null,"DCP:","ABCEX",null,"Trading date:","09.01.2025"]
[null,"Calendar:","T2 - Target2"]
[]
[null,"Collateral:",1000000,null,"Open fin. Risk:",0]
[null,"Coll.Currency:","GBP",null,"Resolved fin. Risk:",0]
[null,"Exchange Rate: ",1063]
[]
[null,"Limit Definition",null,"Currency","Business Day-Base\nlimit (optional*)","Non Business Day-Base\nlimit (optional*)","Collateral\nDistribution\nkey in %**"]
[null,"EPEX_AUCTION_EUR",null,"EUR","52000","0","50"]
[null,"EPEX_CONTINUOUS_EUR",null,"EUR","50000","20000","50"]
[null,"To obtain these member preferences, please send us an O09 form\nand transfer the information from this sheet into the form"]
[]
[]
[]
[]
[]
[]
[null,"Market: EPEX_AUCTION_EUR"]
{"$rows_left_out":29}
{"sheet":"DCP Simulator","index":4,"n_rows":9,"n_cols":4,"rows_kept":9,"cut":false,"hidden":false,"merged":[]}
[]
[]
[]
[]
[]
[]
[]
[]
[null,null,null,"DCP Client tool"]

{"sheet":"DataBackup","index":5,"n_rows":29,"n_cols":14,"rows_kept":29,"cut":false,"hidden":true,"merged":[[13,10,16,10],[13,11,16,11],[13,12,15,13]]}
[]
[]
["Flag","MARKET = Limit Definition","LimitReset on each ?","numBDforExposure\n to + ?","Auction Flag","currency","BD calendar","separate TD calendar",null,null,null,null,null,"DCP"]
[null,"EPEX_CONTINUOUS_GBP","business day",3,0,"GBP","ECC-GBP",0,null,null,null,null,null,"ABCEX"]
[null,"EPEX_CONTINUOUS_EUR","business day",2,0,"EUR","ECC",0]
[null,"EPEX_CPCTY_EUR","day",2,1,"EUR","ECC",1,null,null,"COLLATERAL","In which currency (EUR or GBP) will the collateral be provided?"]
[null,"EEX_GOFR_EUR","day",2,1,"EUR","ECC",1]
[null,"EEX_NEHS_EUR","day",2,1,"EUR","ECC",1,null,null,null,null,null,"COLLATERAL Currency"]
[null,"EPEX_GOEU_EUR","day",2,1,"EUR","ECC",1,null,null,null,null,null,"EUR"]
[null,"EPEX_AUCTION_EUR","day",2,0,"EUR","ECC",0,null,null,null,null,"Exchange Rate GBP/EUR",0.94073377234242717]
[null,"EPEX_AUCTION_GBP","day",3,0,"GBP","ECC-GBP",0,null,null,null,null,"invers zu D9:",1063]
[null,"SEMOPX_AUCTION_EUR","day",3,0,"EUR","ECC",0,null,null,"CLIENT PREFERENCES"]
[null,"SEMOPX_AUCTION_GBP","day",2,0,"GBP","ECC-GBP",0]
[null,"HUPX_AUCTION_EUR","day",2,0,"EUR","ECC",0,null,null,"MARKET",null,"Define the base Limit amount necessary for each calendar day in the markets on business days and non-business days here:"]
[null,"HUPX_CONTINUOUS_EUR","business day",2,0,"EUR","ECC",0]
[null,"BSP_AUCTION_EUR","Day",2,0,"EUR","ECC",0]
[null,"BSP_SEEPX_CONT_EUR","business day",2,0,"EUR","ECC",0,null,null,null,null,"BIZ DAY - ABSOLUTE","NON BIZ DAY - ABSOLUTE"]
[null,null,null,null,null,null,null,null,null,null,"HUPX_AUCTION_EUR","EUR",20,5]
[null,null,null,null,null,null,null,null,null,null,"EPEX_AUCTION_EUR","EUR",1,5]
[null,null,null,null,null,null,null,null,null,null,"EPEX_CONTINUOUS_EUR","EUR",5,5]
{"$rows_left_out":10}
{"sheet":"markets","index":6,"n_rows":19,"n_cols":8,"rows_kept":19,"cut":false,"hidden":true,"merged":[]}
[]
[null,null,null,{"$f":"MAX(($D$4:$D$22)*($A$4:$A$22))","v":2}]
["Flag","MARKET = Limit Definition","LimitReset on each ?","numBDforExposure to + ?","Auction Flag","currency","BD calendar","separate TD calendar"]
[0,"EPEX_CONTINUOUS_GBP","business day",3,0,"GBP","ECC-GBP",0]
[0,"BSP_AUCTION_EUR","day",2,0,"EUR","ECC",0]
[0,"BSP_SEEPX_CONT_EUR","business day",2,0,"EUR","ECC",0]
[0,"EEX_GOFR_POWER_EUR","day",2,1,"EUR","ECC",1]
[0,"EEX_NEHS_EUR","day",2,1,"EUR","ECC",1]
[1,"EPEX_AUCTION_EUR","day",2,0,"EUR","ECC",0]
[0,"EPEX_AUCTION_GBP","day",3,0,"GBP","ECC-GBP",0]
[1,"EPEX_CONTINUOUS_EUR","business day",2,0,"EUR","ECC",0]
[0,"EPEX_CPCTY_EUR","day",2,1,"EUR","ECC",1]
[0,"EPEX_GOEU_EUR","day",2,1,"EUR","ECC",1]
[0,"HUPX_AUCTION_EUR","day",2,0,"EUR","ECC",0]
[0,"HUPX_CONTINUOUS_EUR","business day",2,0,"EUR","ECC",0]
[0,"SEMOPX_AUCTION_EUR","day",2,0,"EUR","ECC",0]
[0,"SEMOPX_AUCTION_GBP","day",2,0,"GBP","ECC-GBP",0]
[0,"EEX_GOFR_GAS_EUR","day",2,1,"EUR","ECC",1]
[0]

{"sheet":"Languages","index":7,"n_rows":217,"n_cols":8,"rows_kept":217,"cut":false,"hidden":true,"merged":[]}
["MSO-Name","MSO-Code","Description Deutsch","Description Deutsch","Description Français","Description English","Descrizione Tedesco","Descripción Español"]
["msoLanguageIDAfrikaans",1078,"Afrikaans","Afrikaans","Afrikaans","Afrikaans","Afrikaans","Afrikaans"]
["msoLanguageIDArabic",1025,"Arabisch","Arabisch","Arabe","Arabic (Libyan)","Arabo (libico)","Árabe (libio)"]
["msoLanguageIDArabicLibya",4097,"Arabisch (Libyen)","Arabisch (Libyen)","Arabe (Libye)","Arabic (Libya)","Arabo (Libia)","Árabe (Libia)"]
["msoLanguageIDArabicEgypt",3073,"Arabisch Ägypten","Arabisch Ägypten","Arabe égyptien","Arabic Egypt","Arabo Egitto","Árabe de Egipto"]
["msoLanguageIDArabicBahrain",15361,"Arabisch Bahrain","Arabisch Bahrain","arabe bahreïnien","Arabic Bahrain","Arabo Bahrein","Árabe bahreiní"]
["msoLanguageIDArabicIraq",2049,"Arabisch irakisch","Arabisch irakisch","Arabe irakien","Arabic Iraqi","Arabo iracheno","Árabe iraquí"]
["msoLanguageIDArabicJordan",11265,"Arabisch Jordan","Arabisch Jordan","arabe Jordanie","Arabic Jordan","Arabo Giordania","Árabe Jordania"]
["msoLanguageIDArabicQatar",16385,"Arabisch Katar","Arabisch Katar","Arabe du Qatar","Arabic Qatar","Arabo Qatar","Árabe Qatar"]
["msoLanguageIDArabicKuwait",13313,"Arabisch Kuwait","Arabisch Kuwait","Arabe Koweït","Arabic Kuwait","Arabo Kuwait","Árabe Kuwait"]
["msoLanguageIDArabicLebanon",12289,"Arabisch Libanon","Arabisch Libanon","Arabe Libanais","Arabic Lebanon","Arabo Libano","Árabe Líbano"]
["msoLanguageIDArabicMorocco",6145,"Arabisch Marokko","Arabisch Marokko","Arabe marocain","Arabic Morocco","Arabo Marocco","Árabe Marruecos"]
["msoLanguageIDArabicOman",8193,"Arabisch Oman","Arabisch Oman","Arabe Oman","Arabic Oman","Arabo Oman","Árabe Omán"]
["msoLanguageIDArabicSyria",10241,"Arabisch Syrien","Arabisch Syrien","Arabe Syrien","Arabic Syria","Arabo Siria","Árabe Siria"]
["msoLanguageIDArabicTunisia",7169,"Arabisch Tunesien","Arabisch Tunesien","Arabe Tunisie","Arabic Tunisia","Arabo Tunisia","Árabe Túnez"]
["msoLanguageIDArabicUAE",14337,"Arabisch VAE","Arabisch VAE","Arabe EAU","Arabic UAE","Arabo Emirati Arabi Uniti","Árabe EAU"]
["msoLanguageIDAzeriCyrillic",2092,"Aserbaidschanisch Kyrillisch","Aserbaidschanisch Kyrillisch","Azerbaïdjanais Cyrillique","Azerbaijani Cyrillic","Azerbaijani cirillico","Azerbaiyano cirílico"]
["msoLanguageIDBasque",1069,"Baskisch (Baskisch)","Baskisch (Baskisch)","Basque (basque)","Basque (Basque)","Basco (basco)","Vasco"]
["msoLanguageIDBengali",1093,"Bengali","Bengali","Bengali","Bengali","Bengalese","Bengalí"]
["msoLanguageIDBosnian",4122,"Bosnisch","Bosnisch","Bosniaque","Bosnian","Bosniaco","Bosnio"]
{"$rows_left_out":198}
{"sheet":"calendar","index":8,"n_rows":1027,"n_cols":34,"rows_kept":1027,"cut":false,"hidden":true,"merged":[]}
["ECC",null,null,"bank holidays",null,"Markets with separate trading day calendars",null,null,null,"Year: "]
["2023-01-02",null,"UsedFlag",{"$f":"IF(ISERROR(VLOOKUP(D3,start!$B$17:$B$24,1,FALSE)),0,1)","v":0},null,{"$f":"MAX($G$2:$I$2)","v":210},{"$f":"COUNT(G$4:G$302)","v":15},{"$f":"COUNT(H$4:H$308)","v":24},{"$f":"COUNT(I$4:I$310)","v":210},{"$f":"COUNT(J$4:J$312)","v":17}]
["2023-01-03",null,null,"GBP",null,{"$f":"COUNTA(G3:Z3)","v":5},"EPEX_CPCTY_EUR","EEX_GOFR_POWER_EUR","EEX_NEHS_EUR","EPEX_GOEU_EUR","EEX_GOFR_GAS_EUR"]
["2023-01-04",null,{"$f":"COUNT($D$4:$D$88)","v":25},"1900-01-01",null," ","2022-03-24","2020-05-18","2022-10-04","2022-09-28","2024-12-04",null,null,null,null,null,null,null,null,null,null,null,null,null,null,null,null,null,null,null,null,null,null,"x"]
["2023-01-05",null,null,"2022-04-15",null,null,"2022-04-28","2021-04-21","2022-10-06","2022-10-26","2025-03-04",null,null,null,null,null,null,null,null,null,null,null,null,null,null,null,null,null,null,null,null,null,null,"x"]
["2023-01-06",null,null,"2022-04-18",null,null,"2022-06-23","2021-12-13","2022-10-11","2022-11-23","2025-06-04",null,null,null,null,null,null,null,null,null,null,null,null,null,null,null,null,null,null,null,null,null,null,"x"]
["2023-01-09",null,null,"2022-05-02",null,null,"2022-09-08","2022-01-19","2022-10-13","2022-12-21","2025-09-03",null,null,null,null,null,null,null,null,null,null,null,null,null,null,null,null,null,null,null,null,null,null,"x"]
["2023-01-10",null,null,"2022-06-02",null,null,"2023-06-22","2022-02-16","2022-10-18","2023-01-25","2025-12-03",null,null,null,null,null,null,null,null,null,null,null,null,null,null,null,null,null,null,null,null,null,null,"x"]
["2023-01-11",null,null,"2022-06-03",null,null,"2023-07-19","2022-03-01","2022-10-20","2023-02-22","2025-12-23",null,null,null,null,null,null,null,null,null,null,null,null,null,null,null,null,null,null,null,null,null,null,"x"]
["2023-01-12",null,null,"2022-08-29",null,null,"2023-09-21","2022-03-03","2022-10-25","2023-03-22",null,null,null,null,null,null,null,null,null,null,null,null,null,null,null,null,null,null,null,null,null,null,null,"x"]
["2023-01-13",null,null,"2022-12-26",null,null,"2023-10-25","2022-03-16","2022-10-27","2023-04-27",null,null,null,null,null,null,null,null,null,null,null,null,null,null,null,null,null,null,null,null,null,null,null,"x"]
["2023-01-16",null,null,"2022-12-27",null,null,"2023-10-26","2022-07-20","2022-11-01","2023-05-24"]
["2023-01-17",null,null,"2023-01-02",null,null,"2023-10-27","2022-08-17","2022-11-03","2023-06-28"]
["2023-01-18",null,null,"2023-04-07",null,null,"2023-12-07","2022-08-23","2022-11-08","2023-07-26"]
["2023-01-19",null,null,"2023-04-10",null,null,"2024-07-19","2022-10-19","2022-11-10","2023-12-20"]
["2023-01-20",null,null,"2023-05-08",null,null,"2024-07-28","2022-12-14","2022-11-15","2024-05-22"]
["2023-01-23",null,null,"2023-05-29",null,null,"2024-10-24","2023-01-18","2022-11-17","2024-09-27"]
["2023-01-24",null,null,"2023-08-28",null,null,"2024-12-05","2023-06-15","2022-11-22","2024-10-23"]
["2023-01-25",null,null,"2023-12-25",null,null,null,"2023-09-21","2022-11-24","2024-11-27"]
["2023-01-26",null,null,"2023-12-26",null,null,null,"2023-10-18","2022-11-29","2024-12-18"]
{"$rows_left_out":1008}
{"sheet":"Holidays","index":9,"n_rows":18,"n_cols":16,"rows_kept":18,"cut":false,"hidden":true,"merged":[]}
[2025,"Selected Federal state/area/calendar:","T2 - Target2","EUR"]
[0,1,2,"3",4,"x",24,25]
["HDNb","English","German","How to calc","Active","T2","GB","CU",null,"Abbreviation","English","German","Column"]
["1.","New Year's Day","Neujahrstag","1. January",null,"x","x",null,null,"T2","Target2","Target2","P",null,null,"x"]
["2.","Good Friday","Karfreitag","Easter Sunday – 2d",null,"x","x",null,null,"GB","Great Britain","Großbritannien","Q",null,null,"x"]
["3.","Easter Monday","Ostermontag","Easter Sunday +1d",null,"x","x",null,null,"CU","Cust. Area","Benutzerdefiniert","R",null,null,"x"]
["4.","Early May bank holiday","Früher Maifeiertag","First Monday in May",null,null,"x"]
["5.","Spring bank holiday","Frühlingsfeiertag ","Last Monday in May",null,null,"x"]
["6.","Summer bank holiday","Sommerfeiertag ","Last Monday in August",null,null,"x"]
["7.","Christmas Day","Weihnachtstag","25. December",null,"x","x",null,null,null,null,null,null,null,null,"x"]
["8.","Boxing Day","Zweiter Weihnachtsfeiertag","26. December",null,"x","x",null,null,null,null,null,null,null,null,"x"]
["9.","Substitute day 1","Ersatzfeiertag 1","28. December"]
["10.","Substitute day 2","Ersatzfeiertag 2","29. December"]
["11.","Customer Day 1","Benutzerdefinierter Tag 1","2022-10-02"]
["12.","Customer Day 2","Benutzerdefinierter Tag 2","2022-11-02"]
["13.","Customer Day 3","Benutzerdefinierter Tag 3","2022-12-02"]
["14.","Customer Day 4","Benutzerdefinierter Tag 4","13.02.2022"]
["15.","Customer Day 5","Benutzerdefinierter Tag 5","14.02.2022"]

{"sheet":"DCP_LimitCalculation","index":10,"n_rows":45,"n_cols":21,"rows_kept":45,"cut":false,"hidden":true,"merged":[]}
["Fill in the highlighted cells :","09.01.2025","Thursday",null,"Calculated limit distribution",null,null,null,null,null,null,"Nb","Caption","BL1","BL2","BL3","BL4","BL5","BL6","BL7","BL8"]
[null,"Values in EUR / percent",null,null,null,"Continuous","System:",null,null,"System:",null,1,"Collateral:",52000,50000,1,1,1,1,2,7]
["Collateral ",1000000,null,null,null,"Intraday","M7",null," Auction","ETS",null,2,"Base limit BD Intraday :"]
["Base limit BD Intraday ",22,null,null,"16:00 CET","Trading limit",{"$f":"_xlfn.IFS($C$1=\"Monday\",AuxiliaryCalculationTab!D2,$C$1=\"Tuesday\",AuxiliaryCalculationTab!D3,$C$1=\"Wednesday\",AuxiliaryCalculationTab!D4,$C$1=\"Thursday\",AuxiliaryCalculationTab!D5,$C$1=\"Friday\",AuxiliaryCalculationTab!D6)","v":22},null,"Trading limit",{"$f":"_xlfn.IFS($C$1=\"Monday\",AuxiliaryCalculationTab!E2,$C$1=\"Tuesday\",AuxiliaryCalculationTab!E3,$C$1=\"Wednesday\",AuxiliaryCalculationTab!E4,$C$1=\"Thursday\",AuxiliaryCalculationTab!E5,$C$1=\"Friday\",AuxiliaryCalculationTab!E6)","v":1},null,3,"Base limit NBD Intraday :"]
["Base limit NBD Intraday ",1,null,null,null,null,null,null,null,null,null,4,"Base limit Auction:"]
["Base limit Auction",1,null,null,null,"Available Collateral",{"$f":"B3","v":1000000},null,"Available Collateral",{"$f":"B3","v":1000000},null,5,"Intraday Distribution Percentage:",50,50]
["Intraday Distribution percentage",0.5,null,null,null,"BaseExposure",{"$f":"_xlfn.IFS($C$1=\"Monday\",AuxiliaryCalculationTab!B2,$C$1=\"Tuesday\",AuxiliaryCalculationTab!B3,$C$1=\"Wednesday\",AuxiliaryCalculationTab!B4,$C$1=\"Thursday\",AuxiliaryCalculationTab!B5,$C$1=\"Friday\",AuxiliaryCalculationTab!B6)","v":49},null,"BaseExposure",{"$f":"_xlfn.IFS($C$1=\"Monday\",AuxiliaryCalculationTab!B2,$C$1=\"Tuesday\",AuxiliaryCalculationTab!B3,$C$1=\"Wednesday\",AuxiliaryCalculationTab!B4,$C$1=\"Thursday\",AuxiliaryCalculationTab!B5,$C$1=\"Friday\",AuxiliaryCalculationTab!B6)","v":49},null,6,"Auction Distribution Percentage:"]
["Auction Distribution Percentage",0.5,null,null,null,"Open Risk ",{"$f":"B11","v":0},null,"Open Risk ",{"$f":"B11","v":0},null,7,"Open Financial Risk:"]
[null,null,null,null,null,"  Available Excess Collateral",{"$f":"MAX(G6-G7-G8,0)","v":999951},null,"  Available Excess Collateral",{"$f":"MAX(J6-J7-J8,0)","v":999951},null,8,"Resolved Financial Risk "]
[null,"Values in EUR",null,null,null,"x market distribution",{"$f":"B7","v":0.5},null,"x market distribution",{"$f":"B8","v":0.5},null,9,"Dynamic Limit",66969,54586.23,43668984,54586.23,194294065]
["Open Financial Risk",0,null,null,null,"x limit reset days ",1,null,"x limit reset days ",{"$f":"_xlfn.IFS($C$1=\"Monday\",AuxiliaryCalculationTab!C2,$C$1=\"Tuesday\",AuxiliaryCalculationTab!C3,$C$1=\"Wednesday\",AuxiliaryCalculationTab!C4,$C$1=\"Thursday\",AuxiliaryCalculationTab!C5,$C$1=\"Friday\",AuxiliaryCalculationTab!C6)","v":1}]
["Resolved Financial Risk ",0,null,null,null,"   Dynamic  Limit",{"$f":"(G9*G10)/G11","v":499975.5},null,"   Dynamic  Limit",{"$f":"(J9*J10)/J11","v":499975.5}]
[null,null,null,null,null,"+ Base limit",{"$f":"_xlfn.IFS($C$1=\"Monday\",AuxiliaryCalculationTab!D2,$C$1=\"Tuesday\",AuxiliaryCalculationTab!D3,$C$1=\"Wednesday\",AuxiliaryCalculationTab!D4,$C$1=\"Thursday\",AuxiliaryCalculationTab!D5,$C$1=\"Friday\",AuxiliaryCalculationTab!D6)","v":22},null,"+ Base limit",{"$f":"_xlfn.IFS($C$1=\"Monday\",AuxiliaryCalculationTab!E2,$C$1=\"Tuesday\",AuxiliaryCalculationTab!E3,$C$1=\"Wednesday\",AuxiliaryCalculationTab!E4,$C$1=\"Thursday\",AuxiliaryCalculationTab!E5,$C$1=\"Friday\",AuxiliaryCalculationTab!E6)","v":1}]
[null,null,null,null,"18:00 CET","Trading limit",{"$f":"G12+G13","v":499997.5},null,"Trading limit",{"$f":"J12+J13","v":499976.5}]
[]
[null,null,null,null,"09:00 CET (t+1)","Trading limit",{"$f":"G14+(B12*B7)","v":499997.5},null,"Trading limit",{"$f":"J14+(B12*B8)","v":499976.5}]
[]
[]
["Note:"]
["For Intraday market: the full limit on Friday 18:00 CET is valid until Monday morning. There is no reset during the weekend."]
{"$rows_left_out":26}
{"sheet":"AuxiliaryCalculationTab","index":11,"n_rows":20,"n_cols":6,"rows_kept":20,"cut":false,"hidden":true,"merged":[[19,0,19,1]]}
["EUR","Base Exposure  ","Limit Reset day Auction ","Base limit addition Intraday","Base limit addition Auction"]
["Monday",{"$f":"(2*DCP_LimitCalculation!B4)+DCP_LimitCalculation!B6","v":45},1,{"$f":"DCP_LimitCalculation!B4","v":22},{"$f":"DCP_LimitCalculation!B6","v":1}]
["Tuesday",{"$f":"(2*DCP_LimitCalculation!B4)+DCP_LimitCalculation!B6","v":45},1,{"$f":"DCP_LimitCalculation!B4","v":22},{"$f":"DCP_LimitCalculation!B6","v":1}]
["Wednesday",{"$f":"(2*DCP_LimitCalculation!B4)+DCP_LimitCalculation!B6","v":45},1,{"$f":"DCP_LimitCalculation!B4","v":22},{"$f":"DCP_LimitCalculation!B6","v":1}]
["Thursday",{"$f":"(2*DCP_LimitCalculation!B4)+(2*DCP_LimitCalculation!B5)+(3*DCP_LimitCalculation!B6)","v":49},1,{"$f":"DCP_LimitCalculation!B4","v":22},{"$f":"DCP_LimitCalculation!B6","v":1}]
["Friday",{"$f":"(2*DCP_LimitCalculation!B4)+(2*DCP_LimitCalculation!B5)+(3*DCP_LimitCalculation!B6)","v":49},3,{"$f":"DCP_LimitCalculation!B4+(2*DCP_LimitCalculation!B5)","v":24},{"$f":"DCP_LimitCalculation!B6","v":1}]
[]
[]
[]
[]
[]
["Freitag = Base limit BD Intraday plus (2 * Base limit NBD Intraday )"]
[]
[]
[]
[]
[]
[]
[]
["Limit Definition",null,"Currency","Business Day-Base\nlimit (optional*)","Non Business Day-Base\nlimit (optional*)","Collateral\nDistribution\nkey in %**"]